Name,Email,Financial Status,Paid at,Fulfillment Status,Fulfilled at,Accepts Marketing,Currency,Subtotal,Shipping,Taxes,Total,Discount Code,Discount Amount,Shipping Method,Created at,Lineitem quantity,Lineitem name,Lineitem price,Lineitem compare at price,Lineitem sku,Lineitem requires shipping,Lineitem taxable,Lineitem fulfillment status,Billing Name,Billing Street,Billing Address1,Billing Address2,Billing Company,Billing City,Billing Zip,Billing Province,Billing Country,Billing Phone,Shipping Name,Shipping Street,Shipping Address1,Shipping Address2,Shipping Company,Shipping City,Shipping Zip,Shipping Province,Shipping Country,Shipping Phone,Notes,Note Attributes,Cancelled at,Payment Method,Payment Reference,Refunded Amount,Vendor,Id,Tags,Risk Level,Source,Lineitem discount,Tax 1 Name,Tax 1 Value,Tax 2 Name,Tax 2 Value,Tax 3 Name,Tax 3 Value,Tax 4 Name,Tax 4 Value,Tax 5 Name,Tax 5 Value
#71410,103034006@qq.com,paid,2015-12-11 06:04:21 +0100,unfulfilled,,no,EUR,162.22,42.00,0.00,204.22,"",0.00,14 kg,2015-12-11 06:04:21 +0100,1,"HOLLE Pouchy  pear, banana with kiwi, 90g",1.19,,39030,true,true,pending,赵 玉文,兴隆台区 胜利小区36-1-302,兴隆台区 胜利小区36-1-302,"",,盘锦市,'124010,,CN,13804270522,Zhao Yuwen,"Xinglongtaiqu, Shenglixiaoqu36-1-302",Xinglongtaiqu,Shenglixiaoqu36-1-302,"",Panjinshi,'124010,,CN,13804270522,Liaoning,"",,PayPal Payments Standard,c5169693573.1,0.00,Allyouneedfresh.cn.com,1942797061,"",Low,web,0.00,,,,,,,,,,
#71410,103034006@qq.com,,,,,,,,,,,,,,2015-12-11 06:04:21 +0100,2,"FERRERO KINDER Bueno, 6 pcs",1.89,"",13863,true,true,pending,,,,,,,,,,,,,,,,,,,,,,,,,,,Allyouneedfresh.cn.com,,,,,0.00,,,,,,,,,,
#71410,103034006@qq.com,,,,,,,,,,,,,,2015-12-11 06:04:21 +0100,1,"Ferrero Mon Chéri, bitter-chocolate For you, 10 St/ 佛列罗蒙雪丽，黑巧克力，10块",2.19,"",13850,true,true,pending,,,,,,,,,,,,,,,,,,,,,,,,,,,Allyouneedfresh.cn.com,,,,,0.00,,,,,,,,,,
#71410,103034006@qq.com,,,,,,,,,,,,,,2015-12-11 06:04:21 +0100,2,"FERRERO KINDER Schoko-Bons chocolate eggs, 125g",1.69,"",13873,true,true,pending,,,,,,,,,,,,,,,,,,,,,,,,,,,Allyouneedfresh.cn.com,,,,,0.00,,,,,,,,,,
#71410,103034006@qq.com,,,,,,,,,,,,,,2015-12-11 06:04:21 +0100,2,"Ferrero Küsschen, Packung, 178 g/费列罗爱之吻，榛仁巧克力礼盒，178克",2.69,"",13855,true,true,pending,,,,,,,,,,,,,,,,,,,,,,,,,,,Allyouneedfresh.cn.com,,,,,0.00,,,,,,,,,,
#71410,103034006@qq.com,,,,,,,,,,,,,,2015-12-11 06:04:21 +0100,3,"Ferrero Küsschen, White Chocolate, 178 g/费列罗爱之吻，限量版榛仁白巧克力礼盒，178克",2.69,"",26456,true,true,pending,,,,,,,,,,,,,,,,,,,,,,,,,,,Allyouneedfresh.cn.com,,,,,0.00,,,,,,,,,,
#71410,103034006@qq.com,,,,,,,,,,,,,,2015-12-11 06:04:21 +0100,2,"Duplo, Riegel Chocnut, 5 St/duplo，全榛巧克力条，5支",1.99,"",45960,true,true,pending,,,,,,,,,,,,,,,,,,,,,,,,,,,Allyouneedfresh.cn.com,,,,,0.00,,,,,,,,,,
#71410,103034006@qq.com,,,,,,,,,,,,,,2015-12-11 06:04:21 +0100,3,"Duplo, chocolate bar , 10 Pieces",2.19,"",13862,true,true,pending,,,,,,,,,,,,,,,,,,,,,,,,,,,Allyouneedfresh.cn.com,,,,,0.00,,,,,,,,,,
#71410,103034006@qq.com,,,,,,,,,,,,,,2015-12-11 06:04:21 +0100,24,"Knoppers, milk-hazel nut slices, 10 Pcs/ Knoppers, 牛奶，榛子片迷你 10块",2.49,"",28944,true,true,pending,,,,,,,,,,,,,,,,,,,,,,,,,,,Allyouneedfresh.cn.com,,,,,0.00,,,,,,,,,,
#71410,103034006@qq.com,,,,,,,,,,,,,,2015-12-11 06:04:21 +0100,2,"HiPP, 100% organic canola oil, 250 ml/喜宝100%有机芥花油，250毫升",3.99,"",40495,true,true,pending,,,,,,,,,,,,,,,,,,,,,,,,,,,Allyouneedfresh.cn.com,,,,,0.00,,,,,,,,,,
#71410,103034006@qq.com,,,,,,,,,,,,,,2015-12-11 06:04:21 +0100,6,"BEBA Toddlers' milk 1+, 600 g/贝巴婴儿奶粉1+段，600克 - BEBA Toddlers' milk 1+",9.99,"",14381,true,true,pending,,,,,,,,,,,,,,,,,,,,,,,,,,,Allyouneedfresh.cn.com,,,,,0.00,,,,,,,,,,
#71411,61141312@qq.com,paid,2015-12-11 06:04:53 +0100,unfulfilled,,no,EUR,104.22,23.00,0.00,127.22,"",0.00,4 kg,2015-12-11 06:04:52 +0100,1,"ELMEX Toothpaste for kids, 50 ml/ELMEX 儿童牙膏，50毫升 - ELMEX toothpaste for kids",1.79,,29567,true,true,pending,Xinmei Wei,"FuJianSheng JianZhu SheJiYuan,  TongHuLu 188 Hao",FuJianSheng JianZhu SheJiYuan, TongHuLu 188 Hao,,Fuzhou ,'350001,,CN,13860625921,Xinmei Wei,"FuJianSheng JianZhu SheJiYuan,  TongHuLu 188 Hao",FuJianSheng JianZhu SheJiYuan, TongHuLu 188 Hao,,Fuzhou ,'350001,,CN,13860625921,Fujian,"",,PayPal Payments Standard,c5169721733.1,0.00,Allyouneedfresh.cn.com,1942799301,"",Low,web,0.00,,,,,,,,,,
#71411,61141312@qq.com,,,,,,,,,,,,,,2015-12-11 06:04:52 +0100,1,"SIGNAL Kids Toothbrush milk teeth 1-6 years, 1 pc/SIGNAL洁诺可爱可站立儿童软毛乳牙牙刷1-6岁，1支 - SIGNAL Kids toothbrush, milk teeth 1-6 years",1.49,"",16892,true,true,pending,,,,,,,,,,,,,,,,,,,,,,,,,,,Allyouneedfresh.cn.com,,,,,0.00,,,,,,,,,,
#71411,61141312@qq.com,,,,,,,,,,,,,,2015-12-11 06:04:52 +0100,1,"tetesept, Sea salt back & shoulder, 600 g/tetesept，舒缓肩背浴盐海盐，600克",4.79,"",33987,true,true,pending,,,,,,,,,,,,,,,,,,,,,,,,,,,Allyouneedfresh.cn.com,,,,,0.00,,,,,,,,,,
#71411,61141312@qq.com,,,,,,,,,,,,,,2015-12-11 06:04:52 +0100,1,"KARINA, Fine chocolate coffee cream, 200 g",1.39,"",19829,true,true,pending,,,,,,,,,,,,,,,,,,,,,,,,,,,Allyouneedfresh.cn.com,,,,,0.00,,,,,,,,,,
#71411,61141312@qq.com,,,,,,,,,,,,,,2015-12-11 06:04:52 +0100,2,"JENSEN’S liver-pâté with goose meat, 80 g/ Jensen's 简尼鹅肝泥80g",1.69,"",40674,true,true,pending,,,,,,,,,,,,,,,,,,,,,,,,,,,Allyouneedfresh.cn.com,,,,,0.00,,,,,,,,,,
#71411,61141312@qq.com,,,,,,,,,,,,,,2015-12-11 06:04:52 +0100,1,"Doppelherz, Hot Cranberry m. Vit C + Zinc, 10 Btl/双心aktiv，热蔓越莓，维C+锌茶饮，10包",3.79,"",27748,true,true,pending,,,,,,,,,,,,,,,,,,,,,,,,,,,Allyouneedfresh.cn.com,,,,,0.00,,,,,,,,,,
#71411,61141312@qq.com,,,,,,,,,,,,,,2015-12-11 06:04:52 +0100,1,"tetesept, Children Bathing Box, 150 g/tetesept，儿童欢乐泡浴组合，150克",4.29,"",51405,true,true,pending,,,,,,,,,,,,,,,,,,,,,,,,,,,Allyouneedfresh.cn.com,,,,,0.00,,,,,,,,,,
#71411,61141312@qq.com,,,,,,,,,,,,,,2015-12-11 06:04:52 +0100,5,"tetesept, Cough bonbons Sugar Free, 75 g/tetesept，无糖夹心止咳润喉糖，75克",2.19,"",38489,true,true,pending,,,,,,,,,,,,,,,,,,,,,,,,,,,Allyouneedfresh.cn.com,,,,,0.00,,,,,,,,,,
#71411,61141312@qq.com,,,,,,,,,,,,,,2015-12-11 06:04:52 +0100,5,"DOPPELHERZ Aktiv Eyes extra day + night, 30 pcs/双心日夜护眼胶囊，30粒 - DOPPELHERZ Aktiv Eyes extra, day + night",5.29,"",17922,true,true,pending,,,,,,,,,,,,,,,,,,,,,,,,,,,Allyouneedfresh.cn.com,,,,,0.00,,,,,,,,,,
#71411,61141312@qq.com,,,,,,,,,,,,,,2015-12-11 06:04:52 +0100,5,"DOPPELHERZ Aktiv Calcium 600+ D3, 30 pcs/双心Aktiv，钙 600+维生素D3营养片，30片 - DOPPELHERZ AKTIV Calcium 600+ D3",3.19,"",14479,true,true,pending,,,,,,,,,,,,,,,,,,,,,,,,,,,Allyouneedfresh.cn.com,,,,,0.00,,,,,,,,,,
#71411,61141312@qq.com,,,,,,,,,,,,,,2015-12-11 06:04:52 +0100,5,"DOPPELHERZ Aktiv Omega-3 sea fish oil capsules 1000, 80 pcs/双心Omega-3 1000毫克深海鱼油胶囊，80粒 - DOPPELHERZ Aktiv omega-3 sea fish oil capsules 1000",5.99,"",24922,true,true,pending,,,,,,,,,,,,,,,,,,,,,,,,,,,Allyouneedfresh.cn.com,,,,,0.00,,,,,,,,,,
#71412,chen_831124@163.com,paid,2015-12-11 06:05:15 +0100,unfulfilled,,no,EUR,106.18,31.00,0.00,137.18,"",0.00,8 kg,2015-12-11 06:05:14 +0100,6,"ALWAYS Ultra long plus with wings,22 pcs - Always",3.99,,48320,true,true,pending,jingjing chen,yanqiaozhen xinhuiyuan 137dong 402# ,yanqiaozhen xinhuiyuan 137dong 402# ,"",,wuxi,'214000,,CN,13861737219,jingjing chen,yanqiaozhen xinhuiyuan 137dong 402# ,yanqiaozhen xinhuiyuan 137dong 402# ,"",,wuxi,'214000,,CN,13861737219,Jiangsu,"",,Ogone DirectLink,c5169736261.1,0.00,Allyouneedfresh.cn.com,1942801029,"",Medium,web,0.00,,,,,,,,,,
#71412,chen_831124@163.com,,,,,,,,,,,,,,2015-12-11 06:05:14 +0100,2,"HERBACIN WUTA KAMILLE Hand cream, 1x 75 ml / 贺本清小甘菊经典护手霜，1x 75 ml - WUTA KAMILLE Hand cream",2.29,"",16762,true,true,pending,,,,,,,,,,,,,,,,,,,,,,,,,,,Allyouneedfresh.cn.com,,,,,0.00,,,,,,,,,,
#71412,chen_831124@163.com,,,,,,,,,,,,,,2015-12-11 06:05:14 +0100,2,"LANGNESE Flotte Biene fruit blossom honey, 500g - LANGNESE Flotte Biene fruit blossom honey",5.19,"",43260,true,true,pending,,,,,,,,,,,,,,,,,,,,,,,,,,,Allyouneedfresh.cn.com,,,,,0.00,,,,,,,,,,
#71412,chen_831124@163.com,,,,,,,,,,,,,,2015-12-11 06:05:14 +0100,2,"LANGNESE Flotte Biene Wild blosson honey, 500 g - LANGNESE Flotte Biene Wild blosson honey",4.99,"",33348,true,true,pending,,,,,,,,,,,,,,,,,,,,,,,,,,,Allyouneedfresh.cn.com,,,,,0.00,,,,,,,,,,
#71412,chen_831124@163.com,,,,,,,,,,,,,,2015-12-11 06:05:14 +0100,15,"Knoppers, milk-hazel nut slices, 10 Pcs/ Knoppers, 牛奶，榛子片迷你 10块",2.49,"",28944,true,true,pending,,,,,,,,,,,,,,,,,,,,,,,,,,,Allyouneedfresh.cn.com,,,,,0.00,,,,,,,,,,
#71412,chen_831124@163.com,,,,,,,,,,,,,,2015-12-11 06:05:14 +0100,5,"Always Ultra, Normal Plus with wings, 2 x 13 St/Always Ultra干爽网面日用护翼卫生巾  4滴水  13+13片装 - always 2  x 13",3.99,"",50902,true,true,pending,,,,,,,,,,,,,,,,,,,,,,,,,,,Allyouneedfresh.cn.com,,,,,0.00,,,,,,,,,,
#71413,avril_cha@outlook.com,paid,2015-12-11 06:21:26 +0100,unfulfilled,,no,EUR,86.92,27.00,0.00,113.92,"",0.00,6 kg,2015-12-11 06:21:25 +0100,2,"EM EUKAL Children cherry bonbons sugar-free, 75 g/索丹博士儿童成人无糖咳嗽止咳化痰润喉棒棒糖樱桃味,75克 - EM EUKAL Children sugar free cherry bonbons",1.49,,14703,true,true,pending,cai loucong,"no.193 HuanchengNanlu,, ZheShangSecurities","no.193 HuanchengNanlu,",ZheShangSecurities,,pujiang,'322200,,CN,14757916920,cai loucong,"no.193 HuanchengNanlu,, ZheShangSecurities","no.193 HuanchengNanlu,",ZheShangSecurities,,pujiang,'322200,,CN,14757916920,Zhejiang,"",,PayPal Payments Standard,c5169844485.1,0.00,Allyouneedfresh.cn.com,1942877829,"",Low,web,0.00,,,,,,,,,,
#71413,avril_cha@outlook.com,,,,,,,,,,,,,,2015-12-11 06:21:25 +0100,6,"HIPP Children's milk, 800 g",13.99,"",16958,true,true,pending,,,,,,,,,,,,,,,,,,,,,,,,,,,Allyouneedfresh.cn.com,,,,,0.00,,,,,,,,,,
#71414,vovo2911@163.com,paid,2015-12-11 06:44:28 +0100,unfulfilled,,no,EUR,155.86,34.00,0.00,189.86,"",0.00,10 kg,2015-12-11 06:44:27 +0100,4,"HiPP BIO porridge, rice flakes, 400 g/喜宝有机免敏婴儿米粉，400克",3.99,,33003,true,true,pending,Pei An,HuaFuDaDao 898 Hao 11 Dong 2 DanYuan 2002,HuaFuDaDao 898 Hao 11 Dong 2 DanYuan 2002,"",,ChengDu,'610000,,CN,18782262911,Pei An,HuaFuDaDao 898 Hao 11 Dong 2 DanYuan 2002,HuaFuDaDao 898 Hao 11 Dong 2 DanYuan 2002,"",,ChengDu,'610000,,CN,18782262911,Sichuan,"",,PayPal Payments Standard,c5154930117.1,0.00,Allyouneedfresh.cn.com,1942973893,"",Low,web,0.00,,,,,,,,,,
#71414,vovo2911@163.com,,,,,,,,,,,,,,2015-12-11 06:44:27 +0100,10,"HIPP BIO Combiotik pre, 600 g - 1 x 600 g HIPP BIO Combiotik pre",13.99,"",12138,true,true,pending,,,,,,,,,,,,,,,,,,,,,,,,,,,Allyouneedfresh.cn.com,,,,,0.00,,,,,,,,,,
#71415,yueyingying1987@163.com,paid,2015-12-11 06:54:08 +0100,unfulfilled,,no,EUR,104.57,29.00,0.00,133.57,"",0.00,7 kg,2015-12-11 06:54:08 +0100,1,"lavera, Duschgel Bio-Wildrose, 200 ml /Lavera，有机野玫瑰系列，沐浴露， 200 毫升",3.39,,51460,true,true,pending,Yue  Yingying,"Room502buildingNo.12,DongFangLiJing Residential Quater DingHai District ZhouShan City ZheJiang  Province ","Room502buildingNo.12,DongFangLiJing Residential Quater DingHai District ZhouShan City ZheJiang  Province ","",,ZhouShan,'316000,,CN,8615168099410,Yue  Yingying,"Room502buildingNo.12, DongFangLiJing Residential Quater,DingHai District ",Room502buildingNo.12,"DongFangLiJing Residential Quater,DingHai District ","",ZhouShan,'316000,,CN,15168099410,Zhejiang,"",,Ogone DirectLink,c5170135685.1,0.00,Allyouneedfresh.cn.com,1943008837,"",Low,web,0.00,,,,,,,,,,
#71415,yueyingying1987@163.com,,,,,,,,,,,,,,2015-12-11 06:54:08 +0100,1,"lavera basic sensitive, Moisturizing Lotion + 25 ml, 225 ml/Lavera，基础防敏系列，保湿润肤露加量25毫升装，225 毫升",5.29,"",48060,true,true,pending,,,,,,,,,,,,,,,,,,,,,,,,,,,Allyouneedfresh.cn.com,,,,,0.00,,,,,,,,,,
#71415,yueyingying1987@163.com,,,,,,,,,,,,,,2015-12-11 06:54:08 +0100,1,"lavera basic sensitive, Eye Cream Q10, 15 ml/Lavera，基础防敏系列，Q10抗皱保湿眼霜，15毫升",8.39,"",48998,true,true,pending,,,,,,,,,,,,,,,,,,,,,,,,,,,Allyouneedfresh.cn.com,,,,,0.00,,,,,,,,,,
#71415,yueyingying1987@163.com,,,,,,,,,,,,,,2015-12-11 06:54:08 +0100,1,"SEBAMED Cream with 2% vitamin E, 75ml",5.79,"",35856,true,true,pending,,,,,,,,,,,,,,,,,,,,,,,,,,,Allyouneedfresh.cn.com,,,,,0.00,,,,,,,,,,
#71415,yueyingying1987@163.com,,,,,,,,,,,,,,2015-12-11 06:54:08 +0100,1,"SEBAMED Soap-free cleansing bar Olive, 150 g/施巴橄榄油净肤洁面抗敏感香皂，150克 - SEBAMED Soap-free cleansing bar Olive",1.79,"",35790,true,true,pending,,,,,,,,,,,,,,,,,,,,,,,,,,,Allyouneedfresh.cn.com,,,,,0.00,,,,,,,,,,
#71415,yueyingying1987@163.com,,,,,,,,,,,,,,2015-12-11 06:54:08 +0100,8,"BEBA Toddlers' milk 1+, 600 g/贝巴婴儿奶粉1+段，600克 - BEBA Toddlers' milk 1+",9.99,"",14381,true,true,pending,,,,,,,,,,,,,,,,,,,,,,,,,,,Allyouneedfresh.cn.com,,,,,0.00,,,,,,,,,,
#71416,suge920@163.com,paid,2015-12-11 06:59:20 +0100,unfulfilled,,no,EUR,85.80,40.00,0.00,125.80,"",0.00,13 kg,2015-12-11 06:59:19 +0100,20,"BEBIVITA Follow-on formula 2, 500g - BEBIVITA Follow-on formula 2",4.29,,47447,true,true,pending,Pingqiu Li,"Shanxi Sheng Yuncheng Shi Yanhu Qu, Xingfuli Bojun7-2-1502",Shanxi Sheng Yuncheng Shi Yanhu Qu,Xingfuli Bojun7-2-1502,,Yuncheng,'044000,,CN,13333489170,Pingqiu Li,"Shanxi Sheng Yuncheng Shi Yanhu Qu, Xingfuli Bojun7-2-1502",Shanxi Sheng Yuncheng Shi Yanhu Qu,Xingfuli Bojun7-2-1502,,Yuncheng,'044000,,CN,13333489170,Shanxi,"",,Ogone DirectLink,c5170097221.1,0.00,Allyouneedfresh.cn.com,1943030661,"",Low,web,0.00,,,,,,,,,,
#71417,17275568@qq.com,paid,2015-12-11 07:11:05 +0100,unfulfilled,,no,EUR,199.84,42.00,0.00,241.84,2F3KMSCH65587,3.00,14 kg,2015-12-11 07:11:05 +0100,1,"HiPP Fruit Fun, Banana & Mango with carrot, 90 g/Hipp 喜宝香蕉芒果胡萝卜即吸果冻，90克",0.99,,49704,true,true,pending,JINGFEI LI,sifajupangjianxinbianlidian   xibaganglu176hao  qiaoxiqu,sifajupangjianxinbianlidian   xibaganglu176hao  qiaoxiqu,"",,zhangjiakou,'075000,,CN,18031397466,JINGFEI LI,"sifajupangjianxinbianlidian, xibaganglu176hao  qiaoxiqu",sifajupangjianxinbianlidian,xibaganglu176hao  qiaoxiqu,"",zhangjiakou,'075000,,CN,18031397466,Hebei,"",,Ogone DirectLink,c5170219461.2,0.00,Allyouneedfresh.cn.com,1943068741,"",Low,web,0.00,,,,,,,,,,
#71417,17275568@qq.com,,,,,,,,,,,,,,2015-12-11 07:11:05 +0100,1,"HIPP Fruit fun strawberry banana apple, 90 g/喜宝吸吸乐苹果香蕉草莓口味吸入式果泥，90g",0.99,"",16989,true,true,pending,,,,,,,,,,,,,,,,,,,,,,,,,,,Allyouneedfresh.cn.com,,,,,0.00,,,,,,,,,,
#71417,17275568@qq.com,,,,,,,,,,,,,,2015-12-11 07:11:05 +0100,1,"Dr. Oetker Vitalis Crunchy Chocolate Muesli fine tart, 600 g/Dr. Oetker欧特家博士 VITALIS香脆巧克力营养全麦麦片，600克",2.99,"",52944,true,true,pending,,,,,,,,,,,,,,,,,,,,,,,,,,,Allyouneedfresh.cn.com,,,,,0.00,,,,,,,,,,
#71417,17275568@qq.com,,,,,,,,,,,,,,2015-12-11 07:11:05 +0100,1,"HiPP BIO porridge, rice flakes, 400 g/喜宝有机免敏婴儿米粉，400克",3.99,"",33003,true,true,pending,,,,,,,,,,,,,,,,,,,,,,,,,,,Allyouneedfresh.cn.com,,,,,0.00,,,,,,,,,,
#71417,17275568@qq.com,,,,,,,,,,,,,,2015-12-11 07:11:05 +0100,3,"HiPP, plum puree with Pear, 190 g - 1+",1.29,"",16982,true,true,pending,,,,,,,,,,,,,,,,,,,,,,,,,,,Allyouneedfresh.cn.com,,,,,0.00,,,,,,,,,,
#71417,17275568@qq.com,,,,,,,,,,,,,,2015-12-11 07:11:05 +0100,6,"JENSEN’S luxury liver-pâté, 80g/ Jensens's 猪肝猪肉泥 80g",1.69,"",40673,true,true,pending,,,,,,,,,,,,,,,,,,,,,,,,,,,Allyouneedfresh.cn.com,,,,,0.00,,,,,,,,,,
#71417,17275568@qq.com,,,,,,,,,,,,,,2015-12-11 07:11:05 +0100,6,"JENSEN’S liver-pâté with goose meat, 80 g/ Jensen's 简尼鹅肝泥80g",1.69,"",40674,true,true,pending,,,,,,,,,,,,,,,,,,,,,,,,,,,Allyouneedfresh.cn.com,,,,,0.00,,,,,,,,,,
#71417,17275568@qq.com,,,,,,,,,,,,,,2015-12-11 07:11:05 +0100,20,"Knoppers, milk-hazel nut slices, 10 Pcs/ Knoppers, 牛奶，榛子片迷你 10块",2.49,"",28944,true,true,pending,,,,,,,,,,,,,,,,,,,,,,,,,,,Allyouneedfresh.cn.com,,,,,0.00,,,,,,,,,,
#71417,17275568@qq.com,,,,,,,,,,,,,,2015-12-11 07:11:05 +0100,2,"MILUPA Aptamil Eazy Pack follow-up-milk 3, new formula, 800 g - MILUPA Aptamil Eazy Pack follow-up-milk 3, new formula",19.99,"",32980,true,true,pending,,,,,,,,,,,,,,,,,,,,,,,,,,,Allyouneedfresh.cn.com,,,,,0.00,,,,,,,,,,
#71417,17275568@qq.com,,,,,,,,,,,,,,2015-12-11 07:11:05 +0100,5,"MILUPA APTAMIL Children milk 1+, 600 g / MILUPA爱他美1+段奶粉，600 g",15.99,"",30389,true,true,pending,,,,,,,,,,,,,,,,,,,,,,,,,,,Allyouneedfresh.cn.com,,,,,0.00,,,,,,,,,,
#71418,yuyuxq@gmail.com,paid,2015-12-11 07:17:18 +0100,unfulfilled,,no,EUR,83.82,31.00,0.00,114.82,"",0.00,8 kg,2015-12-11 07:17:17 +0100,1,"Ferrero Rocher, 25er Box, 312 g/ 佛列罗，25个盒装巧克力，312g",5.49,,13857,true,true,pending,yu xiaoqiong,huajilu 2long 5hao 401shi,huajilu 2long 5hao 401shi,"",,Shanghai,'200231,,CN,86-13816988272,yu xiaoqiong,huajilu 2long 5hao 401shi,huajilu 2long 5hao 401shi,"","",Shanghai,'200231,,CN,13816988272,Shanghai,"",,Ogone DirectLink,c5170318149.1,0.00,Allyouneedfresh.cn.com,1943088837,"",Low,web,0.00,,,,,,,,,,
#71418,yuyuxq@gmail.com,,,,,,,,,,,,,,2015-12-11 07:17:17 +0100,1,"Theramed, Toothpaste Fresh Breath, 100 ml",1.79,"",21937,true,true,pending,,,,,,,,,,,,,,,,,,,,,,,,,,,Allyouneedfresh.cn.com,,,,,0.00,,,,,,,,,,
#71418,yuyuxq@gmail.com,,,,,,,,,,,,,,2015-12-11 07:17:17 +0100,1,"Theramed, toothpaste Natural White, 100 ml",1.49,"",11566,true,true,pending,,,,,,,,,,,,,,,,,,,,,,,,,,,Allyouneedfresh.cn.com,,,,,0.00,,,,,,,,,,
#71418,yuyuxq@gmail.com,,,,,,,,,,,,,,2015-12-11 07:17:17 +0100,1,"Theramed, Toothpaste Original, 100 ml/Theramed 站立式牙膏，100毫升",1.49,"",11869,true,true,pending,,,,,,,,,,,,,,,,,,,,,,,,,,,Allyouneedfresh.cn.com,,,,,0.00,,,,,,,,,,
#71418,yuyuxq@gmail.com,,,,,,,,,,,,,,2015-12-11 07:17:17 +0100,1,"Hanuta, Hazelnut slice Minis, 200 g/ Hanuta,榛子切片饼干，200g",2.29,"",13865,true,true,pending,,,,,,,,,,,,,,,,,,,,,,,,,,,Allyouneedfresh.cn.com,,,,,0.00,,,,,,,,,,
#71418,yuyuxq@gmail.com,,,,,,,,,,,,,,2015-12-11 07:17:17 +0100,1,"Hanuta, Hazelnut slice 10 pcs/ Hanuta,榛子切片饼干，10块",1.99,"",19276,true,true,pending,,,,,,,,,,,,,,,,,,,,,,,,,,,Allyouneedfresh.cn.com,,,,,0.00,,,,,,,,,,
#71418,yuyuxq@gmail.com,,,,,,,,,,,,,,2015-12-11 07:17:17 +0100,20,"Knoppers, milk-hazel nut slices, 10 Pcs/ Knoppers, 牛奶，榛子片迷你 10块",2.49,"",28944,true,true,pending,,,,,,,,,,,,,,,,,,,,,,,,,,,Allyouneedfresh.cn.com,,,,,0.00,,,,,,,,,,
#71418,yuyuxq@gmail.com,,,,,,,,,,,,,,2015-12-11 07:17:17 +0100,1,"Milka, Melo Cakes, 100 g/Milka，妙卡全奶饼干巧克力球，100克",1.59,"",27159,true,true,pending,,,,,,,,,,,,,,,,,,,,,,,,,,,Allyouneedfresh.cn.com,,,,,0.00,,,,,,,,,,
#71418,yuyuxq@gmail.com,,,,,,,,,,,,,,2015-12-11 07:17:17 +0100,1,"Haribo, Little Cupcakes, 175 g/haribo，小点心棉花糖，175克",0.99,"",52935,true,true,pending,,,,,,,,,,,,,,,,,,,,,,,,,,,Allyouneedfresh.cn.com,,,,,0.00,,,,,,,,,,
#71418,yuyuxq@gmail.com,,,,,,,,,,,,,,2015-12-11 07:17:17 +0100,10,"FERRERO KINDER Schoko-Bons chocolate eggs, 125g",1.69,"",13873,true,true,pending,,,,,,,,,,,,,,,,,,,,,,,,,,,Allyouneedfresh.cn.com,,,,,0.00,,,,,,,,,,
#71419,vikey_zhao@163.com,paid,2015-12-11 07:19:18 +0100,unfulfilled,,no,EUR,260.01,40.00,0.00,300.01,"",0.00,13 kg,2015-12-11 07:19:18 +0100,2,"Seeberger, Blue grapes, 200 g/ Seeberger 天然葡萄干 200克",1.39,,34869,true,true,pending,Hongye Zhao," room1503 unit 1 building no.12 shijiaboyuan, xihongmen daxing district", room1503 unit 1 building no.12 shijiaboyuan,xihongmen daxing district,,Beijing,'100162,,CN,13811861763,Hongye Zhao," room1503 unit 1 building no.12 shijiaboyuan, xihongmen daxing district", room1503 unit 1 building no.12 shijiaboyuan,xihongmen daxing district,,Beijing,'100162,,CN,13811861763,Beijing,"",,Ogone DirectLink,c5170304965.1,0.00,Allyouneedfresh.cn.com,1943094981,"",Low,web,0.00,,,,,,,,,,
#71419,vikey_zhao@163.com,,,,,,,,,,,,,,2015-12-11 07:19:18 +0100,1,"LEIBNIZ Biscuits Zoo farm, 125 g/莱布尼兹快乐农场动物饼干，125克",1.39,"",17627,true,true,pending,,,,,,,,,,,,,,,,,,,,,,,,,,,Allyouneedfresh.cn.com,,,,,0.00,,,,,,,,,,
#71419,vikey_zhao@163.com,,,,,,,,,,,,,,2015-12-11 07:19:18 +0100,8,"MILUPA APTAMIL Children milk 2+, 600 g / MILUPA 爱他美2+段奶粉，600 g",15.99,"",30236,true,true,pending,,,,,,,,,,,,,,,,,,,,,,,,,,,Allyouneedfresh.cn.com,,,,,0.00,,,,,,,,,,
#71419,vikey_zhao@163.com,,,,,,,,,,,,,,2015-12-11 07:19:18 +0100,8,"MILUPA APTAMIL Children milk 1+, 600 g / MILUPA爱他美1+段奶粉，600 g",15.99,"",30389,true,true,pending,,,,,,,,,,,,,,,,,,,,,,,,,,,Allyouneedfresh.cn.com,,,,,0.00,,,,,,,,,,
#71420,290679247@qq.com,paid,2015-12-11 07:19:29 +0100,unfulfilled,,no,EUR,138.50,42.00,0.00,180.50,"",0.00,14 kg,2015-12-11 07:19:28 +0100,6,"DOPPELHERZ Active Calcium + 750 + D3 + Biotin + Folic Acid, 1 x 30 capsules",3.99,,14508,true,true,pending,qingli liu,tianjinshidagangqufujinyuan24haolou1danyuan102 13011376006,tianjinshidagangqufujinyuan24haolou1danyuan102 13011376006,"",,tianjin,'300270,,CN,13011376006,qingli liu,tianjinshidagangqufujinyuan24haolou1danyuan102 13011376006,tianjinshidagangqufujinyuan24haolou1danyuan102 13011376006,"",,tianjin,'300270,,CN,13011376006,Tianjin,"",,PayPal Payments Standard,c5170307141.1,0.00,Allyouneedfresh.cn.com,1943095621,"",Low,web,0.00,,,,,,,,,,
#71420,290679247@qq.com,,,,,,,,,,,,,,2015-12-11 07:19:28 +0100,20,"Yogurette, Chocolate bar, 125 g/Yogurette，巧克力棒，125克",1.39,"",51938,true,true,pending,,,,,,,,,,,,,,,,,,,,,,,,,,,Allyouneedfresh.cn.com,,,,,0.00,,,,,,,,,,
#71420,290679247@qq.com,,,,,,,,,,,,,,2015-12-11 07:19:28 +0100,5,"HARIBO Original fruit gum Golden Bears, 200 g/哈瑞宝金熊混合水果橡皮糖，250克 - HARIBO Original Fruit gum Golden Bears",0.99,"",13898,true,true,pending,,,,,,,,,,,,,,,,,,,,,,,,,,,Allyouneedfresh.cn.com,,,,,0.00,,,,,,,,,,
#71420,290679247@qq.com,,,,,,,,,,,,,,2015-12-11 07:19:28 +0100,6,"HEIRLER BIO, Skimmed milk power, 250 g",5.99,"",46185,true,true,pending,,,,,,,,,,,,,,,,,,,,,,,,,,,Allyouneedfresh.cn.com,,,,,0.00,,,,,,,,,,
#71420,290679247@qq.com,,,,,,,,,,,,,,2015-12-11 07:19:28 +0100,1,"MILUPA APTAMIL Children milk 2+, 600 g / MILUPA 爱他美2+段奶粉，600 g",15.99,"",30236,true,true,pending,,,,,,,,,,,,,,,,,,,,,,,,,,,Allyouneedfresh.cn.com,,,,,0.00,,,,,,,,,,
#71420,290679247@qq.com,,,,,,,,,,,,,,2015-12-11 07:19:28 +0100,6,"Bebivita Fruit tea, 400 g",2.49,"",19500,true,true,pending,,,,,,,,,,,,,,,,,,,,,,,,,,,Allyouneedfresh.cn.com,,,,,0.00,,,,,,,,,,
#71420,290679247@qq.com,,,,,,,,,,,,,,2015-12-11 07:19:28 +0100,6,"Bebivita Children fennel tea, 400g",2.49,"",19481,true,true,pending,,,,,,,,,,,,,,,,,,,,,,,,,,,Allyouneedfresh.cn.com,,,,,0.00,,,,,,,,,,
#71421,19233010@qq.com,paid,2015-12-11 07:25:50 +0100,unfulfilled,,no,EUR,124.91,40.00,0.00,164.91,"",0.00,13 kg,2015-12-11 07:25:49 +0100,2,"Villa Antinori, Chianti Classico Tr., 14 % Vol., 0,75 l/安东尼世家，经典奇安提干红，14%Vol.，0.75升",21.99,,45782,true,true,pending,XIAOBIN LIANG,"CHONGQING BANAN QU YUDONG YUNJINLU 2# , DIANYAYISHANJUN 15-2-201",CHONGQING BANAN QU YUDONG YUNJINLU 2# ,DIANYAYISHANJUN 15-2-201,,CHONGQING,'401320,,CN,18983578578,XIAOBIN LIANG,"CHONGQING BANAN QU YUDONG YUNJINLU 2# , DIANYAYISHANJUN 15-2-201",CHONGQING BANAN QU YUDONG YUNJINLU 2# ,DIANYAYISHANJUN 15-2-201,,CHONGQING,'401320,,CN,18983578578,Chongqing,"",,PayPal Payments Standard,c5170334597.1,0.00,Allyouneedfresh.cn.com,1943113093,"",Low,web,0.00,,,,,,,,,,
#71421,19233010@qq.com,,,,,,,,,,,,,,2015-12-11 07:25:49 +0100,1,Nachtgold Beerenauslese Icewine 375 ml/ Nachtgold 金冰布伦冰酒375 ml,8.99,"",50692,true,true,pending,,,,,,,,,,,,,,,,,,,,,,,,,,,Allyouneedfresh.cn.com,,,,,0.00,,,,,,,,,,
#71421,19233010@qq.com,,,,,,,,,,,,,,2015-12-11 07:25:49 +0100,2,"Feudi di S. Gregorio, Greco di Tufo DOCG, 0.75 L",14.99,"",39833,true,true,pending,,,,,,,,,,,,,,,,,,,,,,,,,,,Allyouneedfresh.cn.com,,,,,0.00,,,,,,,,,,
#71421,19233010@qq.com,,,,,,,,,,,,,,2015-12-11 07:25:49 +0100,1,"Montigny, Riesling dry, 12,5 % Vol., 0,75 l",9.99,"",45442,true,true,pending,,,,,,,,,,,,,,,,,,,,,,,,,,,Allyouneedfresh.cn.com,,,,,0.00,,,,,,,,,,
#71421,19233010@qq.com,,,,,,,,,,,,,,2015-12-11 07:25:49 +0100,1,"Montigny, Riesling White wine sweet , 0,75 l",9.99,"",45440,true,true,pending,,,,,,,,,,,,,,,,,,,,,,,,,,,Allyouneedfresh.cn.com,,,,,0.00,,,,,,,,,,
#71421,19233010@qq.com,,,,,,,,,,,,,,2015-12-11 07:25:49 +0100,1,"Kloster Eberbach, semi-dry Riesling white wine, 0.75 l",6.99,"",20254,true,true,pending,,,,,,,,,,,,,,,,,,,,,,,,,,,Allyouneedfresh.cn.com,,,,,0.00,,,,,,,,,,
#71421,19233010@qq.com,,,,,,,,,,,,,,2015-12-11 07:25:49 +0100,1,"Feudi di S. Gregorio, Fiano di Avellino DOCG, 0.75L",14.99,"",39832,true,true,pending,,,,,,,,,,,,,,,,,,,,,,,,,,,Allyouneedfresh.cn.com,,,,,0.00,,,,,,,,,,